{"text_format":"3","workbook":"xlsx","n_sheets":3,"sheets":["Instructions","Front sheet","Work sheet 1"],"not_rendered":{"charts":2,"images":3,"macros":1,"defined_names":40},"read":"whole","date_system":"1900"}

{"sheet":"Instructions","index":0,"n_rows":55,"n_cols":4,"rows_kept":55}
[]
[]
[null,null,"SPC Tool"]
[]
[]
[]
[null,null,"INSTRUCTIONS"]
[]
[null,null,"SET UP"]
[]
[null,null,"1.)","Enter your organisation name"]
[]
[null,null,"2.)","Enter your team or unit name"]
[]
[null,null,"3.)","Enter what you are measuring (patients, falls etc.)"]
[]
[null,null,"4.)","Enter a maximum theoretical value (as an error check)"]
[]
[null,null,"5)","Enter the start date"]
[]
{"$rows_left_out":36}
{"sheet":"Front sheet","index":1,"n_rows":51,"n_cols":47,"rows_kept":51,"merged":[[3,5,3,7],[3,11,3,12],[4,5,4,7],[4,25,5,26],[5,5,5,7],[20,27,21,28],[40,7,40,23],[41,2,41,4],[41,8,41,23],[42,2,42,4],[42,8,42,23],[43,2,43,4],[43,8,43,23],[44,2,44,4],[44,8,44,23],[45,8,45,23]]}
[]
[]
[null,null,"SPC Tool",{"$nulls":42},"08:00:00"]
[null,null,"Organisation Name",{"$nulls":8},"Maximum number",{"$nulls":5},{"$f":"IF(P6=\"days\",\"Include weekends?\",\"\")","v":"Include weekends?"},null,null,"Yes",{"$nulls":17},"Days",null,"Yes",{"$nulls":4},"18:00:00"]
[null,null,"Team/unit Name",{"$nulls":8},"Start date",{"$nulls":26},"Weeks",null,"No"]
[null,null,"Your measure",{"$nulls":8},"Planned duration",{"$nulls":3},"Days",null,"Recording time",null,null,"18:00:00"]
[]
[null,null,"Date",{"$f":"F6","v":0},"date",{"$f":"F6","v":0},"date",{"$f":"F6","v":0},"date",{"$f":"F6","v":0},{"$nulls":17},"Interventions Annotation date","Annotation"]
[null,1,{"$f":"IF(U4=\"No\",IF(WEEKDAY(O5)=1,O5+1,IF(WEEKDAY(O5)=7,O5+2,O5)),O5)","v":"00:00:00"},0,{"$f":"IF(C36=\"\",\"\",IF($P$6=\"Days\",IF(C36>$O$5+$O$6-2,\"\",IF($U$4=\"No\",IF(WEEKDAY(C36)=6,C36+3,C36+1),C36+1)),IF(C36<$O$5+($O$6*7)-1,C36+7,\"\")))","v":""},null,{"$f":"IF(E36=\"\",\"\",IF($P$6=\"Days\",IF(E36>$O$5+$O$6-2,\"\",IF($U$4=\"No\",IF(WEEKDAY(E36)=6,E36+3,E36+1),E36+1)),IF(E36<$O$5+($O$6*7)-1,E36+7,\"\")))","v":""},null,{"$f":"IF(G36=\"\",\"\",IF($P$6=\"Days\",IF(G36>$O$5+$O$6-2,\"\",IF($U$4=\"No\",IF(WEEKDAY(G36)=6,G36+3,G36+1),G36+1)),IF(G36<$O$5+($O$6*7)-1,G36+7,\"\")))","v":""},{"$nulls":36},5,10]
[null,2,{"$f":"IF(C9=\"\",\"\",IF($P$6=\"Days\",IF(C9>$O$5+$O$6-2,\"\",IF($U$4=\"No\",IF(WEEKDAY(C9)=6,C9+3,C9+1),C9+1)),IF(C9<$O$5+($O$6*7)-1,C9+7,\"\")))","v":""},null,{"$f":"IF(E9=\"\",\"\",IF($P$6=\"Days\",IF(E9>$O$5+$O$6-2,\"\",IF($U$4=\"No\",IF(WEEKDAY(E9)=6,E9+3,E9+1),E9+1)),IF(E9<$O$5+($O$6*7)-1,E9+7,\"\")))","v":""},null,{"$f":"IF(G9=\"\",\"\",IF($P$6=\"Days\",IF(G9>$O$5+$O$6-2,\"\",IF($U$4=\"No\",IF(WEEKDAY(G9)=6,G9+3,G9+1),G9+1)),IF(G9<$O$5+($O$6*7)-1,G9+7,\"\")))","v":""},null,{"$f":"IF(I9=\"\",\"\",IF($P$6=\"Days\",IF(I9>$O$5+$O$6-2,\"\",IF($U$4=\"No\",IF(WEEKDAY(I9)=6,I9+3,I9+1),I9+1)),IF(I9<$O$5+($O$6*7)-1,I9+7,\"\")))","v":""},{"$nulls":36},6,11]
[null,3,{"$f":"IF(C10=\"\",\"\",IF($P$6=\"Days\",IF(C10>$O$5+$O$6-2,\"\",IF($U$4=\"No\",IF(WEEKDAY(C10)=6,C10+3,C10+1),C10+1)),IF(C10<$O$5+($O$6*7)-1,C10+7,\"\")))","v":""},null,{"$f":"IF(E10=\"\",\"\",IF($P$6=\"Days\",IF(E10>$O$5+$O$6-2,\"\",IF($U$4=\"No\",IF(WEEKDAY(E10)=6,E10+3,E10+1),E10+1)),IF(E10<$O$5+($O$6*7)-1,E10+7,\"\")))","v":""},null,{"$f":"IF(G10=\"\",\"\",IF($P$6=\"Days\",IF(G10>$O$5+$O$6-2,\"\",IF($U$4=\"No\",IF(WEEKDAY(G10)=6,G10+3,G10+1),G10+1)),IF(G10<$O$5+($O$6*7)-1,G10+7,\"\")))","v":""},null,{"$f":"IF(I10=\"\",\"\",IF($P$6=\"Days\",IF(I10>$O$5+$O$6-2,\"\",IF($U$4=\"No\",IF(WEEKDAY(I10)=6,I10+3,I10+1),I10+1)),IF(I10<$O$5+($O$6*7)-1,I10+7,\"\")))","v":""},{"$nulls":36},7,6]
[null,4,"",null,"",null,"",null,"",{"$nulls":36},6,8]
[null,5,"",null,"",null,"",null,"",{"$nulls":36},9,9]
[null,6,"",null,"",null,"",null,"",{"$nulls":36},5,10]
[null,7,"",null,"",null,"",null,"",{"$nulls":36},8,11]
[null,8,"",null,"",null,"",null,"",{"$nulls":36},7,12]
[null,null,"",null,"",null,"",null,"",{"$nulls":36},8,13]
[null,9,"",null,"",null,"",null,"",{"$nulls":36},5,6]
[null,10,"",null,"",null,"",null,"",{"$nulls":36},6,8]
[null,11,"",null,"",null,"",null,"",{"$nulls":36},8,9]
{"$rows_left_out":32}
{"sheet":"Work sheet 1","index":2,"n_rows":120,"n_cols":62,"rows_kept":120,"merged":[[0,6,0,14],[1,6,1,14],[2,6,2,14],[3,6,3,14],[3,16,3,17],[3,20,3,22],[3,28,3,30],[3,36,3,37],[3,39,3,40],[4,6,4,14],[5,6,5,14]]}
[{"$nulls":3},"Info from front sheet",null,null,"This type of chart (SPC)  allows us to identify statistically significant changes in data. The dotted lines (process limits) represent the range in which we expect the data to fall if the variation is within expected limits, i.e. normal. There are a number of rules we can use to identify when the process is out of control.",{"$nulls":4},{"$f":"IF(ISERROR(VLOOKUP(100,$G$8:$K$120,9,0)),\"\",VLOOKUP(100,$G$8:$K$120,9,0))","v":""},{"$nulls":4},"Points ><3 sigma",{"$nulls":3},"Runs above mean",{"$nulls":3},"Runs Below mean",{"$nulls":3},"Trend up",{"$nulls":3},"Trend Down",{"$nulls":3},"Points above #Moving Range",null,null,"Points outside Mean+-Sigma"]
[{"$nulls":3},{"$f":"'Front sheet'!F6","v":0},{"$f":"'Front sheet'!P6","v":"Days"},null,{"$f":"IF(Q4<>\"\",Q4,IF(U4<>\"\",U4,IF(AC4<>\"\",AC4,IF(AN4<>\"\",AN4,IF(AQ4<>\"\",AQ4,IF(AK4<>\"\",AK4,\"\"))))))","v":{"$error":"#N/A"}},{"$nulls":9},"how many above",{"$f":"MAX(Q9:Q128)","v":{"$error":"#N/A"}},null,null,{"$f":"IF(SUM(V9:V128)>0,\"Yes\",0)","v":0},{"$nulls":3},{"$f":"IF(SUM(Z9:Z128)>0,\"Yes\",0)","v":0},{"$nulls":3},{"$f":"IF(SUM(AD9:AD128)>0,\"Yes\",0)","v":0},{"$nulls":3},{"$f":"IF(SUM(AH9:AH128)>0,\"Yes\",0)","v":0},{"$nulls":3},"how many above",{"$f":"IF(ISERROR(MAX(AK9:AK128)),\"\",MAX(AK9:AK128))","v":1},null,"how many points",{"$f":"IF(ISERROR(SUM(OFFSET($AO$9,0,0,$E$3,2))),\"\",SUM(OFFSET($AO$9,0,0,$E$3,2)))","v":0}]
[{"$nulls":3},"Rows of data",{"$f":"MAX(B9:B120)","v":2},null,{"$f":"IF(AND(U4<>\"\",U4<>G2),U4,IF(AND(AC4<>\"\",AC4<>G2),AC4,IF(AND(AN4<>\"\",AN4<>G2),AN4,IF(AND(AQ4<>\"\",AQ4<>G2),AQ4,IF(AND(AK4<>\"\",AK4<>G2),AK4,\"\")))))","v":{"$error":"#N/A"}},{"$nulls":9},"how many below",{"$f":"MAX(R9:R128)","v":{"$error":"#N/A"}},{"$nulls":21},"Proportion",{"$f":"AO2/E3","v":0},{"$nulls":9},{"$f":"SUM((AX9:AX120))","v":1}]
[{"$nulls":3},"Recalculate 1",{"$f":"IF(BF6=0,0,BF5)","v":0},null,{"$f":"IF(AND(AC4<>\"\",AC4<>G2,AC4<>G3),AC4,IF(AND(AN4<>\"\",AN4<>G2,AN4<>G3),AN4,IF(AND(AQ4<>\"\",AQ4<>G2,AQ4<G3),AQ4,IF(AND(AK4<>\"\",AK4<>G2,AK4<>G3),AK4,\"\"))))","v":{"$error":"#N/A"}},{"$nulls":9},{"$f":"IF($R$3+$R$2>0,\"Points which fall outside the green dotted lines (process limits) are unusual and should be investigated. They represent a system which may be out of control.\",\"\")&IF(R2=0,\"\",IF(R2=1,\" There is \",\" There are \")&R2&IF(R2=1,\" data point which is above the line. \",\" data points which are above the line. \"))&Q5","v":{"$error":"#N/A"}},{"$nulls":3},{"$f":"IF(OR(U2=\"Yes\",Y2=\"Yes\"),\"When more than 7 sequential points fall above or below the mean that is unusual and may indicate a sigificant change in process. This process is not in control. There is a run of points \" & IF(AND(U2=\"Yes\",Y2=\"Yes\"),\" above and below\",IF(U2= \"Yes\", \" above\", \" below\"))& \" the mean.\",\"\")","v":""},{"$nulls":7},{"$f":"IF(OR(AC2=\"Yes\",AG2=\"Yes\"),\"When there is a run of 7 increasing or decreasing sequential points this may indicate a sigificant change in the process.  This process is not in control.In this data set there is a run of \" & IF(AND(AC2=\"Yes\",AG2=\"Yes\"),\" rising and falling \",IF(AC2= \"Yes\", \"rising\", \"falling\"))& \" points\",\"\")","v":""},{"$nulls":7},{"$f":"IF($AL$3+$AL$2>0,\"On the moving range chart points which fall above the moving range process limit - green dotted line - are unusual and suggest that the system is out of control. This should be investigated.\"&IF(AL2=0,\"\",IF(AL2=1,\" There is \",\" There are \")&AL2&IF(AL2=1,\" data point which is above the line. \",\" data points which are above the line. \")),\"\")","v":"On the moving range chart points which fall above the moving range process limit - green dotted line - are unusual and suggest that the system is out of control. This should be investigated. There is 1 data point which is above the line. "},null,null,{"$f":"IF(AO3>0,\"When more than 15 consecutive points lie within the mean +/- 1σ  this process is considered to be out of control.\",\"\")","v":""},{"$nulls":10},"Date","Intervention1","Intervention2","Intervention3","Intervention4","Intervention5",null,"Recalculate limits","Recalculate limits"]
[{"$nulls":3},"Recalculate 2",{"$f":"IF(BG6=0,0,BG5)","v":0},null,{"$f":"IF(AND(AN4<>\"\",AN4<>G2,AN4<>G3,AN4<>G4),AN4,IF(AND(AQ4<>\"\",AQ4<>G2,AQ4<G3,AQ4<>G4),AQ4,IF(AND(AK4<>\"\",AK4<>G2,AK4<>G3,AK4<>G4),AK4,\"\")))","v":{"$error":"#N/A"}},{"$nulls":9},{"$f":"IF(R3>0,IF(R3=1,\"There is  \",\"There are \")&R3&\" data point(s) below the line\",\"\")","v":{"$error":"#N/A"}},"Rule 1",{"$nulls":4},"Rule 2",{"$nulls":7},"Rule 2",{"$nulls":8},"Rule 4",{"$nulls":11},1,1,1,1,1,null,2,2]
[{"$nulls":3},{"$f":"'Front sheet'!$F$4&\" -\"&'Front sheet'!F5&\" daily performance, starting \"&TEXT('Front sheet'!O5,\"dd/mm/yy\") & IF(AND('Front sheet'!$P$6= \"days\",'Front sheet'!$U$4=\"No\"),\" excluding weekends\",\"\")","v":" - daily performance, starting 00/01/00"},{"$f":"E3-E4-IF(E5<>0,(E3-E5),0)","v":2},null,{"$f":"IF(AND(AK4<>\"\",AK4<>G2,AK4<>G3,AK4<>G4,AK4<>G5),AK4,\"\")","v":{"$error":"#N/A"}},{"$nulls":10},"◊5<",{"$nulls":21},{"$f":"G9-M9/1.128","v":0},{"$f":"G9+M9/1.128","v":0},{"$nulls":9},"Annotation",{"$f":"'Front sheet'!AC9","v":0},{"$f":"'Front sheet'!AC11","v":0},{"$f":"'Front sheet'!$AC$13","v":0},{"$f":"'Front sheet'!$AC$15","v":0},{"$f":"'Front sheet'!$AC$17","v":0},null,{"$f":"'Front sheet'!AC23","v":0},{"$f":"'Front sheet'!AC25","v":0}]
[{"$nulls":3},{"$f":"'Front sheet'!$F$4&\" -\"&'Front sheet'!F5&\" Moving Range, starting \"&TEXT('Front sheet'!O5,\"dd/mm/yy\")","v":" - Moving Range, starting 00/01/00"},{"$nulls":6},"Date","Difference",null,null,"Sigma",null,"> 3","< 3 ","Rules",{"$nulls":26},"Date","Weekday",{"$nulls":4},1,2,3,4,5,null,1,2]
[{"$nulls":3},"Date","Tally","Cumulative Tally","Mean","UCL","LCL","Tally0 - for calculating averages",null,"For. Roll avg","Cumul. Moving Avg.","2.66* MR","3.27*MR",null,"Count","Count","><  3 sigma",null,"7 points > mean",{"$nulls":3},"7 points < mean",{"$nulls":3},"Trend up",{"$nulls":3},"Trend Down",{"$nulls":3},"Moving Range",null,null,"> Mean+Sigma","< Mean-Sigma",{"$nulls":10},{"$f":"OFFSET($AY8,AZ5,0)","v":"00:00:00"},{"$f":"OFFSET($AY8,BA5,0)","v":"00:00:00"},{"$f":"OFFSET($AY8,BB5,0)","v":"00:00:00"},{"$f":"OFFSET($AY8,BC5,0)","v":"00:00:00"},{"$f":"OFFSET($AY8,BD5,0)","v":"00:00:00"},null,{"$f":"OFFSET($AY8,BF5,0)","v":""},{"$f":"OFFSET($AY8,BG5,0)","v":""},null,"For summary data"]
[null,1,1,{"$f":"IF('Front sheet'!$C9=\"\",\"\",'Front sheet'!$C9)","v":"00:00:00"},{"$f":"'Front sheet'!D9","v":0},{"$f":"E9","v":0},{"$f":"IF($E$4=0,AVERAGE(Tally0),IF($E$5=0,IF(C9<=$E$4,AVERAGE(Tally),AVERAGE(Tally2)),IF(C9<=$E$4,AVERAGE(Tally),IF(C9<=$E$5,AVERAGE(Tally2),AVERAGE(Tally3)))))","v":0},{"$f":"H10","v":{"$error":"#N/A"}},{"$f":"I10","v":{"$error":"#N/A"}},{"$f":"IF(ISERROR(E9),\"\",E9)","v":0},{"$f":"D9","v":"00:00:00"},null,{"$f":"M10","v":0},{"$f":"IF(ISERROR((M9*2.66)),N10,(M9*2.66))","v":0},{"$f":"O10","v":0},null,{"$f":"IF(ISERROR($E9),0,IF($E9>$H9,MAX($Q8:Q$8)+1,0))","v":{"$error":"#N/A"}},{"$f":"IF(ISERROR($E9),0,IF($E9<$I9,MAX($R8:R$8)+1,0))","v":{"$error":"#N/A"}},{"$f":"IF(OR(E9>H9,E9<I9),E9,#N/A)","v":{"$error":"#N/A"}},null,{"$f":"IF(ISERROR(E9),0,IF(E9>G9,1,0))","v":0},{"$f":"IF(AND(V8=1,U9=1),1,IF(SUM(U9:U15)>=7,1,0))","v":0},{"$f":"IF(V9=0,#N/A,E9)","v":{"$error":"#N/A"}},null,{"$f":"IF(ISERROR(E9),0,IF(E9<G9,1,0))","v":0},{"$f":"IF(AND(Z8=1,Y9=1),1,IF(SUM(Y9:Y15)>=7,1,0))","v":0},{"$f":"IF(Z9=0,#N/A,E9)","v":{"$error":"#N/A"}},null,{"$f":"IF(OR(ISERROR(E9),ISERROR(E8)),0,IF(E9=E8,0.5,IF(E9>E8,1,0)))","v":0},{"$f":"IF(AND(AD8>0,AC9>0),1,IF(SUM(AC9:AC15)>=7,1,IF(MOD(SUM(AC9:AC15),1)>0,IF(SUM(AC9:AC16)>=7,1,0),0)))","v":0},{"$f":"IF(AD9=0,#N/A,E9)","v":{"$error":"#N/A"}},null,{"$f":"IF(OR(ISERROR(E9),ISERROR(E8)),0,IF(E9=E8,0.5,IF(E9<E8,1,0)))","v":1},{"$f":"IF(AND(AH8>0,AG9>0),1,IF(SUM(AG9:AG15)>=7,1,IF(MOD(SUM(AG9:AG15),1)>0,IF(SUM(AG9:AG16)>=7,1,0),0)))","v":0},{"$f":"IF(AH9=0,#N/A,E9)","v":{"$error":"#N/A"}},null,{"$f":"IF(ISERROR($L9),0,IF($L9>$O9,MAX($AK8:AK$8)+1,0))","v":0},{"$f":"IF(L9>O9,L9,#N/A)","v":{"$error":"#N/A"}},null,{"$f":"IF(AND(J9>$AN$6,J9<$AO$6),1,0)","v":0},{"$f":"IF(AND(AO8=1,AN9=1),1,IF(SUM(AN9:AN23)>=15,1,0))","v":0},{"$nulls":4},{"$f":"K9","v":"00:00:00"},{"$f":"WEEKDAY(AT9)","v":7},null,1,{"$f":"IF(AY9=$AZ$8,1,IF(AY9=$BA$8,2,IF(AY9=$BB$8,3,IF(AY9=$BC$8,4,IF(AY9=$BD$8,5,\"\")))))","v":1},{"$f":"D9","v":"00:00:00"},{"$f":"IF($AZ$6=0,#N/A,IF(AX9=AZ$7,$E9-1,#N/A))","v":{"$error":"#N/A"}},{"$f":"IF($BA$6=0,#N/A,IF($AX9=BA$7,$E9-1,#N/A))","v":{"$error":"#N/A"}},{"$f":"IF($BB$6=0,#N/A,IF($AX9=BB$7,$E9-1,#N/A))","v":{"$error":"#N/A"}},{"$f":"IF($BC$6=0,#N/A,IF($AX9=BC$7,$E9-1,#N/A))","v":{"$error":"#N/A"}},{"$f":"IF($BD$6=0,#N/A,IF($AX9=BD$7,$E9-1,#N/A))","v":{"$error":"#N/A"}},{"$f":"IF(AY9=$BF$8,1,IF(AY9=$BG$8,2,\"\"))","v":""},{"$f":"IF($BF$6=0,#N/A,IF(BE9=BF$7,$E9-1,#N/A))","v":{"$error":"#N/A"}},{"$f":"IF($BG$6=0,#N/A,IF(BE9=BG$7,$E9-1,#N/A))","v":{"$error":"#N/A"}},null,{"$f":"IF(ISERROR(E9),0,E9)","v":0},{"$f":"IF(ISERROR(E9),0,1)","v":1}]
[null,{"$f":"IF(ISERROR(E10),0,C10)","v":2},2,{"$f":"IF('Front sheet'!$C10=\"\",\"\",'Front sheet'!$C10)","v":""},{"$f":"IF('Front sheet'!D10=\"\",\"\",'Front sheet'!D10)","v":""},{"$f":"IF(ISERROR(E10),F9,F9+E10)","v":{"$error":"#VALUE!"}},0,{"$f":"IF($E$3>=13,G10+$N10,#N/A)","v":{"$error":"#N/A"}},{"$f":"IF($E$3>=13,G10-$N10,#N/A)","v":{"$error":"#N/A"}},{"$f":"IF(ISERROR(E10),\"\",E10)","v":""},"",{"$f":"IF(ISERROR(E10),IF(C10<$E$3,0,#N/A),IF(ISERROR(E9),0,IF(E9=\"\",\"\",IF(E10=\"\",\"\",ABS(E9-E10)))))","v":""},{"$f":"IF(ISERROR(IF($E$4=0,AVERAGE(MR_1),IF($E$5=0,IF(C10<=$E$4,AVERAGE(MR_1),AVERAGE(MR_2)),IF(C10<=$E$4,AVERAGE(MR_1),IF(C10<=$E$5,AVERAGE(MR_2),AVERAGE(MR_3)))))),0,IF($E$4=0,AVERAGE(MR_1),IF($E$5=0,IF(C10<=$E$4,AVERAGE(MR_1),AVERAGE(MR_2)),IF(C10<=$E$4,AVERAGE(MR_1),IF(C10<=$E$5,AVERAGE(MR_2),AVERAGE(MR_3))))))","v":0},{"$f":"IF(ISERROR((M10*2.66)),N11,(M10*2.66))","v":0},{"$f":"M10*3.27","v":0},null,{"$f":"IF(ISERROR($E10),0,IF($E10>$H10,MAX($Q$8:Q9)+1,0))","v":{"$error":"#N/A"}},{"$f":"IF(ISERROR($E10),0,IF($E10<$I10,MAX($R$8:R9)+1,0))","v":{"$error":"#N/A"}},{"$error":"#N/A"},null,1,{"$f":"IF(AND(V9=1,U10=1),1,IF(SUM(U10:U16)>=7,1,0))","v":0},{"$error":"#N/A"},null,0,{"$f":"IF(AND(Z9=1,Y10=1),1,IF(SUM(Y10:Y16)>=7,1,0))","v":0},{"$error":"#N/A"},null,1,0,{"$error":"#N/A"},null,{"$f":"IF(OR(ISERROR(E10),ISERROR(E9)),0,IF(E10=E9,0.5,IF(E10<E9,1,0)))","v":0},0,{"$error":"#N/A"},null,{"$f":"IF(ISERROR($L10),0,IF($L10>$O10,MAX($AK$8:AK9)+1,0))","v":1},{"$f":"IF(L10>O10,L10,#N/A)","v":""},null,0,0,{"$nulls":4},{"$f":"K10","v":""},{"$f":"WEEKDAY(AT10)","v":{"$error":"#VALUE!"}},null,2,"","",{"$error":"#N/A"},{"$error":"#N/A"},{"$error":"#N/A"},{"$error":"#N/A"},{"$error":"#N/A"},{"$f":"IF(AY10=$BF$8,1,IF(AY10=$BG$8,2,\"\"))","v":1},{"$error":"#N/A"},{"$error":"#N/A"},null,"",1]
[null,0,3,{"$f":"IF('Front sheet'!$C11=\"\",\"\",'Front sheet'!$C11)","v":""},{"$f":"IF('Front sheet'!D11=\"\",#N/A,'Front sheet'!D11)","v":{"$error":"#N/A"}},{"$f":"IF(ISERROR(E11),F10,F10+E11)","v":{"$error":"#VALUE!"}},0,{"$error":"#N/A"},{"$error":"#N/A"},"","",{"$error":"#N/A"},0,{"$f":"IF(ISERROR((M11*2.66)),N12,(M11*2.66))","v":0},{"$f":"M11*3.27","v":0},null,{"$f":"IF(ISERROR($E11),0,IF($E11>$H11,MAX($Q$8:Q10)+1,0))","v":0},{"$f":"IF(ISERROR($E11),0,IF($E11<$I11,MAX($R$8:R10)+1,0))","v":0},{"$error":"#N/A"},null,0,0,{"$error":"#N/A"},null,0,0,{"$error":"#N/A"},null,0,0,{"$error":"#N/A"},null,0,0,{"$error":"#N/A"},null,{"$f":"IF(ISERROR($L11),0,IF($L11>$O11,MAX($AK$8:AK10)+1,0))","v":0},{"$error":"#N/A"},null,0,0,{"$nulls":4},"",{"$error":"#VALUE!"},null,3,"","",{"$error":"#N/A"},{"$error":"#N/A"},{"$error":"#N/A"},{"$error":"#N/A"},{"$error":"#N/A"},1,{"$error":"#N/A"},{"$error":"#N/A"},null,0,0]
[null,0,4,{"$f":"IF('Front sheet'!$C12=\"\",\"\",'Front sheet'!$C12)","v":""},{"$f":"IF('Front sheet'!D12=\"\",#N/A,'Front sheet'!D12)","v":{"$error":"#N/A"}},{"$error":"#VALUE!"},0,{"$error":"#N/A"},{"$error":"#N/A"},"","",{"$error":"#N/A"},0,0,0,null,{"$f":"IF(ISERROR($E12),0,IF($E12>$H12,MAX($Q$8:Q11)+1,0))","v":0},{"$f":"IF(ISERROR($E12),0,IF($E12<$I12,MAX($R$8:R11)+1,0))","v":0},{"$error":"#N/A"},null,0,0,{"$error":"#N/A"},null,0,0,{"$error":"#N/A"},null,0,0,{"$error":"#N/A"},null,0,0,{"$error":"#N/A"},null,{"$f":"IF(ISERROR($L12),0,IF($L12>$O12,MAX($AK$8:AK11)+1,0))","v":0},{"$error":"#N/A"},null,0,0,{"$nulls":4},"",{"$error":"#VALUE!"},null,4,"","",{"$error":"#N/A"},{"$error":"#N/A"},{"$error":"#N/A"},{"$error":"#N/A"},{"$error":"#N/A"},1,{"$error":"#N/A"},{"$error":"#N/A"},null,0,0]
[null,0,5,{"$f":"IF('Front sheet'!$C13=\"\",\"\",'Front sheet'!$C13)","v":""},{"$f":"IF('Front sheet'!D13=\"\",#N/A,'Front sheet'!D13)","v":{"$error":"#N/A"}},{"$error":"#VALUE!"},0,{"$error":"#N/A"},{"$error":"#N/A"},{"$f":"IF(ISERROR(E13),\"\",E13)","v":""},"",{"$error":"#N/A"},0,0,0,null,{"$f":"IF(ISERROR($E13),0,IF($E13>$H13,MAX($Q$8:Q12)+1,0))","v":0},{"$f":"IF(ISERROR($E13),0,IF($E13<$I13,MAX($R$8:R12)+1,0))","v":0},{"$error":"#N/A"},null,0,0,{"$error":"#N/A"},null,0,0,{"$error":"#N/A"},null,0,0,{"$error":"#N/A"},null,0,0,{"$error":"#N/A"},null,{"$f":"IF(ISERROR($L13),0,IF($L13>$O13,MAX($AK$8:AK12)+1,0))","v":0},{"$error":"#N/A"},null,0,0,{"$nulls":4},"",{"$error":"#VALUE!"},null,5,"","",{"$error":"#N/A"},{"$error":"#N/A"},{"$error":"#N/A"},{"$error":"#N/A"},{"$error":"#N/A"},1,{"$error":"#N/A"},{"$error":"#N/A"},null,0,0]
[null,0,6,{"$f":"IF('Front sheet'!$C14=\"\",\"\",'Front sheet'!$C14)","v":""},{"$f":"IF('Front sheet'!D14=\"\",#N/A,'Front sheet'!D14)","v":{"$error":"#N/A"}},{"$error":"#VALUE!"},0,{"$error":"#N/A"},{"$error":"#N/A"},"","",{"$error":"#N/A"},0,0,0,null,{"$f":"IF(ISERROR($E14),0,IF($E14>$H14,MAX($Q$8:Q13)+1,0))","v":0},{"$f":"IF(ISERROR($E14),0,IF($E14<$I14,MAX($R$8:R13)+1,0))","v":0},{"$error":"#N/A"},null,0,0,{"$error":"#N/A"},null,0,0,{"$error":"#N/A"},null,0,0,{"$error":"#N/A"},null,0,0,{"$error":"#N/A"},null,{"$f":"IF(ISERROR($L14),0,IF($L14>$O14,MAX($AK$8:AK13)+1,0))","v":0},{"$error":"#N/A"},null,0,0,{"$nulls":4},"",{"$error":"#VALUE!"},null,6,"","",{"$error":"#N/A"},{"$error":"#N/A"},{"$error":"#N/A"},{"$error":"#N/A"},{"$error":"#N/A"},1,{"$error":"#N/A"},{"$error":"#N/A"},null,0,0]
[null,0,7,{"$f":"IF('Front sheet'!$C15=\"\",\"\",'Front sheet'!$C15)","v":""},{"$f":"IF('Front sheet'!D15=\"\",#N/A,'Front sheet'!D15)","v":{"$error":"#N/A"}},{"$error":"#VALUE!"},0,{"$error":"#N/A"},{"$error":"#N/A"},"","",{"$error":"#N/A"},0,0,0,null,{"$f":"IF(ISERROR($E15),0,IF($E15>$H15,MAX($Q$8:Q14)+1,0))","v":0},{"$f":"IF(ISERROR($E15),0,IF($E15<$I15,MAX($R$8:R14)+1,0))","v":0},{"$error":"#N/A"},null,0,0,{"$error":"#N/A"},null,0,0,{"$error":"#N/A"},null,0,0,{"$error":"#N/A"},null,0,0,{"$error":"#N/A"},null,{"$f":"IF(ISERROR($L15),0,IF($L15>$O15,MAX($AK$8:AK14)+1,0))","v":0},{"$error":"#N/A"},null,0,0,{"$nulls":4},"",{"$error":"#VALUE!"},null,7,"","",{"$error":"#N/A"},{"$error":"#N/A"},{"$error":"#N/A"},{"$error":"#N/A"},{"$error":"#N/A"},1,{"$error":"#N/A"},{"$error":"#N/A"},null,0,0]
[null,0,8,{"$f":"IF('Front sheet'!$C16=\"\",\"\",'Front sheet'!$C16)","v":""},{"$f":"IF('Front sheet'!D16=\"\",#N/A,'Front sheet'!D16)","v":{"$error":"#N/A"}},{"$error":"#VALUE!"},0,{"$error":"#N/A"},{"$error":"#N/A"},"","",{"$error":"#N/A"},0,0,0,null,{"$f":"IF(ISERROR($E16),0,IF($E16>$H16,MAX($Q$8:Q15)+1,0))","v":0},{"$f":"IF(ISERROR($E16),0,IF($E16<$I16,MAX($R$8:R15)+1,0))","v":0},{"$error":"#N/A"},null,0,0,{"$error":"#N/A"},null,0,0,{"$error":"#N/A"},null,0,0,{"$error":"#N/A"},null,0,0,{"$error":"#N/A"},null,{"$f":"IF(ISERROR($L16),0,IF($L16>$O16,MAX($AK$8:AK15)+1,0))","v":0},{"$error":"#N/A"},null,0,0,{"$nulls":4},"",{"$error":"#VALUE!"},null,8,"","",{"$error":"#N/A"},{"$error":"#N/A"},{"$error":"#N/A"},{"$error":"#N/A"},{"$error":"#N/A"},1,{"$error":"#N/A"},{"$error":"#N/A"},null,0,0]
[null,0,9,{"$f":"IF('Front sheet'!$C17=\"\",\"\",'Front sheet'!$C17)","v":""},{"$f":"IF('Front sheet'!D17=\"\",#N/A,'Front sheet'!D17)","v":{"$error":"#N/A"}},{"$error":"#VALUE!"},0,{"$error":"#N/A"},{"$error":"#N/A"},"","",{"$error":"#N/A"},0,0,0,null,{"$f":"IF(ISERROR($E17),0,IF($E17>$H17,MAX($Q$8:Q16)+1,0))","v":0},{"$f":"IF(ISERROR($E17),0,IF($E17<$I17,MAX($R$8:R16)+1,0))","v":0},{"$error":"#N/A"},null,0,0,{"$error":"#N/A"},null,0,0,{"$error":"#N/A"},null,0,0,{"$error":"#N/A"},null,0,0,{"$error":"#N/A"},null,{"$f":"IF(ISERROR($L17),0,IF($L17>$O17,MAX($AK$8:AK16)+1,0))","v":0},{"$error":"#N/A"},null,0,0,{"$nulls":4},"",{"$error":"#VALUE!"},null,9,"","",{"$error":"#N/A"},{"$error":"#N/A"},{"$error":"#N/A"},{"$error":"#N/A"},{"$error":"#N/A"},1,{"$error":"#N/A"},{"$error":"#N/A"},null,0,0]
[null,0,10,{"$f":"IF('Front sheet'!$C18=\"\",\"\",'Front sheet'!$C18)","v":""},{"$f":"IF('Front sheet'!D18=\"\",#N/A,'Front sheet'!D18)","v":{"$error":"#N/A"}},{"$f":"IF(ISERROR(E18),F17,F17+E18)","v":{"$error":"#VALUE!"}},0,{"$error":"#N/A"},{"$error":"#N/A"},"","",{"$error":"#N/A"},0,0,0,null,{"$f":"IF(ISERROR($E18),0,IF($E18>$H18,MAX($Q$8:Q17)+1,0))","v":0},{"$f":"IF(ISERROR($E18),0,IF($E18<$I18,MAX($R$8:R17)+1,0))","v":0},{"$error":"#N/A"},null,0,0,{"$error":"#N/A"},null,0,0,{"$error":"#N/A"},null,0,0,{"$error":"#N/A"},null,0,0,{"$error":"#N/A"},null,{"$f":"IF(ISERROR($L18),0,IF($L18>$O18,MAX($AK$8:AK17)+1,0))","v":0},{"$error":"#N/A"},null,0,0,{"$nulls":4},"",{"$error":"#VALUE!"},null,10,"","",{"$error":"#N/A"},{"$error":"#N/A"},{"$error":"#N/A"},{"$error":"#N/A"},{"$error":"#N/A"},1,{"$error":"#N/A"},{"$error":"#N/A"},null,0,0]
[null,0,11,{"$f":"IF('Front sheet'!$C19=\"\",\"\",'Front sheet'!$C19)","v":""},{"$f":"IF('Front sheet'!D19=\"\",#N/A,'Front sheet'!D19)","v":{"$error":"#N/A"}},{"$error":"#VALUE!"},0,{"$error":"#N/A"},{"$error":"#N/A"},"","",{"$error":"#N/A"},0,0,0,null,{"$f":"IF(ISERROR($E19),0,IF($E19>$H19,MAX($Q$8:Q18)+1,0))","v":0},{"$f":"IF(ISERROR($E19),0,IF($E19<$I19,MAX($R$8:R18)+1,0))","v":0},{"$error":"#N/A"},null,0,0,{"$error":"#N/A"},null,0,0,{"$error":"#N/A"},null,0,0,{"$error":"#N/A"},null,0,0,{"$error":"#N/A"},null,{"$f":"IF(ISERROR($L19),0,IF($L19>$O19,MAX($AK$8:AK18)+1,0))","v":0},{"$error":"#N/A"},null,0,0,{"$nulls":4},"",{"$error":"#VALUE!"},null,11,"","",{"$error":"#N/A"},{"$error":"#N/A"},{"$error":"#N/A"},{"$error":"#N/A"},{"$error":"#N/A"},1,{"$error":"#N/A"},{"$error":"#N/A"},null,0,0]
[null,0,12,{"$f":"IF('Front sheet'!$C20=\"\",\"\",'Front sheet'!$C20)","v":""},{"$f":"IF('Front sheet'!D20=\"\",#N/A,'Front sheet'!D20)","v":{"$error":"#N/A"}},{"$error":"#VALUE!"},0,{"$error":"#N/A"},{"$error":"#N/A"},"","",{"$error":"#N/A"},0,0,0,null,{"$f":"IF(ISERROR($E20),0,IF($E20>$H20,MAX($Q$8:Q19)+1,0))","v":0},{"$f":"IF(ISERROR($E20),0,IF($E20<$I20,MAX($R$8:R19)+1,0))","v":0},{"$error":"#N/A"},null,0,0,{"$error":"#N/A"},null,0,0,{"$error":"#N/A"},null,0,0,{"$error":"#N/A"},null,0,0,{"$error":"#N/A"},null,{"$f":"IF(ISERROR($L20),0,IF($L20>$O20,MAX($AK$8:AK19)+1,0))","v":0},{"$error":"#N/A"},null,0,0,{"$nulls":4},"",{"$error":"#VALUE!"},null,12,"","",{"$error":"#N/A"},{"$error":"#N/A"},{"$error":"#N/A"},{"$error":"#N/A"},{"$error":"#N/A"},1,{"$error":"#N/A"},{"$error":"#N/A"},null,0,0]
{"$rows_left_out":100}